{"text_format":"1","workbook":"xlsx","n_sheets":14,"sheets":["Macro","A PROJ Instructions","B PROJ Budget","C COMP Instructions","D COMP Budget","E COMP Activités","F COMP Mise à jour Année 1","G COMP Mise à jour Année 2","H COMP Mise à jour Année 3","I Instructions - éditeurs","J Budget Projets de livres","K Budget Revues électroniques","L Budget Revues imprimées","Sheet1"],"not_rendered":{"charts":0,"images":5,"macros":1,"external_links":1,"defined_names":32,"comments":0,"pivot_tables":0},"unopened":[],"bounds":{"document_bytes":16777216,"sheet_cells":100000,"rows_first":2000,"rows_last":500,"rows_between":2000,"halvings":0,"cell_chars":16384,"cell_head_chars":4096},"cells_cut":0,"cells_raw":0,"read":"whole","date_system":"1900"}

{"sheet":"Macro","index":0,"n_rows":37,"n_cols":2,"rows_kept":37,"cut":false,"hidden":false,"merged":[[31,1,31,15],[33,1,34,15],[36,1,37,15],[1,1,1,11],[4,1,4,15],[6,1,7,15],[3,1,3,15],[24,1,24,15],[15,1,16,15],[18,1,18,15],[21,1,21,15],[29,1,29,15]]}
[]
[]
[]
[null,"Appuyer la pratique artistique"]
[null,"Innovation et développement du secteur"]
[]
[null,"Cette composante finance de nombreux types d’activités ayant leur propre section d’onglets avec des pages de budget. Ce document comprend une macro intégrée qui vous dirigera aux sections qui concernent votre activité. Veuillez choisir le bouton pertinent ci-dessous pour votre type d’activité."]
[]
[]
[]
[]
[]
[]
[]
[]
{"$rows_left_out":23}
{"sheet":"A PROJ Instructions","index":1,"n_rows":55,"n_cols":3,"rows_kept":55,"cut":false,"hidden":false,"merged":[[15,1,16,15],[28,2,29,15],[30,2,31,15],[1,1,1,15],[3,1,3,15],[2,1,2,15],[4,1,4,15],[6,1,11,15],[40,2,41,15],[42,1,43,15],[44,2,45,15],[49,1,51,15],[52,1,53,15]]}
[null,"v.201704"]
[null,"Appuyer la pratique artistique : Innovation et développement du secteur - Subventions de projets (à l'exception des éditeurs)"]
[null,"Instructions pour remplir les document « Budget et Annexes »"]
[null,"Consultez l'onglet C pour les instructions de subventions composites."]
[null,"Les éditeurs de livres ou de revues doivent consulter l'onglet I."]
[]
[null,"N'oubliez pas que le formulaire de budget est conçu pour être utilisé par des candidats de différents champs de pratique (disciplines) et pour un large éventail d'activités. Il n'est pas possible d'inclure des catégories de dépenses détaillées pour chaque type d'activité. Vous trouverez plutôt un certain nombre de lignes vides dans le formulaire que vous pouvez utiliser pour préciser les dépenses qui sont pertinentes à votre projet. Choisissez une ligne vide dans la catégorie des coûts qui correspond le mieux à la dépense, inscrivez une brève description qui sera facilement comprise par un comité d'évaluation qui connaît bien votre (vos) forme(s) d’expression artistique, inscrivez le montant de la dépense et, au besoin, ajoutez une note budgétaire pour expliquer le montant."]
[]
[]
[]
[]
[]
[]
[]
[null,"Veuillez noter qu'au bas de la page se trouvent plusieurs onglets."]
{"$rows_left_out":41}
{"sheet":"B PROJ Budget","index":2,"n_rows":163,"n_cols":9,"rows_kept":163,"cut":false,"hidden":false,"merged":[[57,1,57,8],[68,1,68,8],[81,1,81,8],[1,1,1,8],[3,1,3,8],[5,1,5,3],[9,1,9,3],[19,1,19,8],[15,1,15,3],[16,1,16,3],[17,1,17,3],[20,1,20,3],[10,1,10,3],[11,1,11,3],[12,1,12,3],[13,1,13,3],[14,1,14,3],[26,1,26,3],[29,1,29,3],[30,1,30,3],[31,1,31,3],[21,1,21,3],[22,1,22,3],[23,1,23,3],[24,1,24,3],[25,1,25,3],[28,1,28,8],[43,1,43,3],[32,1,32,3],[33,1,33,3],[34,1,34,3],[35,1,35,3],[36,1,36,3],[37,1,37,3],[38,1,38,3],[39,1,39,3],[40,1,40,3],[41,1,41,3],[42,1,42,3],[44,1,44,3],[45,1,45,3],[46,1,46,3],[52,1,52,3],[53,1,53,3],[55,1,55,3],[47,1,47,3],[48,1,48,3],[49,1,49,3],[50,1,50,3],[51,1,51,3],[54,1,54,3],[58,1,58,3],[59,1,59,3],[60,1,60,3],[61,1,61,3],[62,1,62,3],[74,1,74,3],[63,1,63,3],[64,1,64,3],[65,1,65,3],[66,1,66,3],[69,1,69,3],[70,1,70,3],[71,1,71,3],[72,1,72,3],[73,1,73,3],[162,1,163,7],[82,8,83,8],[85,1,85,8],[103,1,103,8],[114,1,114,8],[136,1,136,8],[75,1,75,3],[76,1,76,3],[78,1,78,3],[82,2,82,4],[144,1,144,8]]}
[null,"v.201704"]
[null,"Appuyer la pratique artistique : Innovation et développement du secteur - Subvention de projets"]
[]
[null,"Salaires et honoraires versés dans le cadre des subventions de base du Conseil des arts du Canada ne sont pas des coûts admissibles."]
[]
[null,"Veuillez inscrire ci-dessous les dépenses relatives à votre projet\n",null,null,"Budget","1ère mise à jour, au besoin","2e mise à jour, au besoin","Données réelles ","Notes au budget (facultatif) "]
[null,null,null,null,"Date :","Date :","Date :","Date :"]
[]
[null,"Honoraires professionnels"]
[null,"Expert-conseil, responsable des ateliers, technicien, mentor, personnel chargé de la documentation et responsable de l’événement, par exemple"]
[null,"Frais du candidat ou subsistance. Pour des projets de 5 jours et plus, vous pouvez demander des fonds pour les frais de subsistance ou un cachet d’artiste pour vous-même jusqu’à 500 $ par personne, par semaine. Veuillez ajouter des détails dans les notes au budget."]
[null,"Redevances et droits d’auteur"]
[]
[]
[]
{"$rows_left_out":149}
{"sheet":"C COMP Instructions","index":3,"n_rows":60,"n_cols":3,"rows_kept":60,"cut":false,"hidden":false,"merged":[[61,2,61,15],[1,1,1,15],[2,1,2,15],[3,1,3,15],[4,1,4,15],[15,1,16,15],[32,2,33,15],[30,2,31,15],[34,2,35,15],[28,2,29,15],[57,1,58,15],[59,1,60,15],[6,1,11,15],[48,2,49,15],[50,1,51,15],[52,2,53,15]]}
[null,"v.201704"]
[null,"Appuyer la pratique artistique : Innovation et développement du secteur - Subventions  composites (à l'exception des éditeurs) "]
[null,"Instructions pour remplir les document « Budget et Annexes »"]
[null,"Consultez l'onglet A pour les instructions de subventions de projets."]
[null,"Les éditeurs de livres ou de revues doivent consulter l'onglet I."]
[]
[null,"N'oubliez pas que le formulaire de budget est conçu pour être utilisé par des candidats de différents champs de pratique (disciplines) et pour un large éventail d'activités. Il n'est pas possible d'inclure des catégories de dépenses détaillées pour chaque type d'activité. Vous trouverez plutôt un certain nombre de lignes vides dans le formulaire que vous pouvez utiliser pour préciser les dépenses qui sont pertinentes à vos activitès. Choisissez une ligne vide dans la catégorie des coûts qui correspond le mieux à la dépense, inscrivez une brève description qui sera facilement comprise par un comité d'évaluation qui connaît bien votre (vos) forme(s) d’expression artistique, inscrivez le montant de la dépense et, au besoin, ajoutez une note budgétaire pour expliquer le montant."]
[]
[]
[]
[]
[]
[]
[]
[null,"Veuillez noter qu'au bas de la page se trouvent plusieurs onglets."]
{"$rows_left_out":46}
{"sheet":"D COMP Budget","index":4,"n_rows":242,"n_cols":7,"rows_kept":242,"cut":false,"hidden":false,"merged":[[1,1,1,6],[9,1,9,6],[39,1,39,6],[132,1,132,6],[170,2,170,6],[96,2,96,6],[97,2,97,6],[111,1,111,6],[129,1,129,6],[157,2,157,6],[133,2,133,6],[241,1,242,5],[4,1,7,1],[165,1,165,6],[178,1,178,6],[213,1,213,6],[221,1,221,6],[193,2,193,6],[199,2,199,6],[205,2,205,6],[187,2,187,6],[227,2,227,6],[24,1,24,6],[181,2,181,6],[139,2,139,6],[145,2,145,6],[151,2,151,6]]}
[null,"v.201704"]
[null,"Appuyer la pratique artistique : Innovation et développement du secteur - Subventions  composites"]
[]
[null,null,"Budget, 1er exercice","Budget, 2e exercice\n (s’il y a lieu)","Budget, 3e exercice\n (s’il y a lieu)","Budget total pour tous les exercices","Notes au budget (facultatif) "]
[null,"Veuillez inscrire ci-dessous les dépenses relatives à votre projet  ","de","de","de"]
[null,null,"Date :","Date :","Date :"]
[null,null,"à","à","à"]
[null,null,"Date :","Date :","Date :"]
[]
[null,"Honoraires professionnels"]
[null,"Expert-conseil, responsable des ateliers, technicien, mentor, personnel chargé de la documentation et responsable de l’événement, par exemple"]
[null,"Redevances et droits d’auteur",null,null,null,{"$f":"C12+D12+E12","v":0}]
[null,null,null,null,null,0]
[null,null,null,null,null,0]
[null,null,null,null,null,0]
{"$rows_left_out":228}
{"sheet":"E COMP Activités","index":5,"n_rows":50,"n_cols":9,"rows_kept":50,"cut":false,"hidden":false,"merged":[[3,2,3,8],[5,2,5,8],[6,2,6,8],[7,2,7,8],[1,2,1,8]]}
[null,null,"v.201704"]
[null,null,"Appuyer la pratique artistique : Innovation et développement du secteur - Subventions  composites"]
[]
[null,null,"Services, activités de soutien, événements publics et programmation connexe"]
[]
[null,null,"Fournissez une liste représentative de vos services, activités de soutien, événements publics et de votre programmation connexe que vous avez livrés lors des 2 dernières années et de l'année en cours. Fournissez des détails concernant vos plans futurs, autant que vous les connaissez. La première année devrait être solide. Cependant, il est possible que, plus les années visées sont lointaines, moins vous aurez de détails à offrir."]
[null,null,"Exemples d'activités à inclure : projection/visionnement d'œuvres, présentation, lecture, représentation d'artistes lors d'événements, résidence, vitrine, recherche, atelier pour artistes professionnels, etc."]
[null,null,"Au besoin, regroupez les programmes ou activités similaires. "]
[]
[null,null,"Mois/année ou Période de temps","Nom de l'événement\n(le cas échéant)","Type d'activité","Contributeur clé ou Responsable de l'activité","Autres collaborateurs clés","Principaux bénéficiaires","Détails/Commentaires"]
[null,1]
[null,2]
[null,3]
[null,4]
[null,5]
{"$rows_left_out":36}
{"sheet":"F COMP Mise à jour Année 1","index":6,"n_rows":242,"n_cols":7,"rows_kept":242,"cut":false,"hidden":false,"merged":[[1,1,1,6],[9,1,9,6],[24,1,24,6],[39,1,39,6],[96,2,96,6],[4,1,7,1],[241,1,242,5],[132,1,132,6],[165,1,165,6],[178,1,178,6],[213,1,213,6],[221,1,221,6],[227,2,227,6],[133,2,133,6],[139,2,139,6],[199,2,199,6],[205,2,205,6],[129,1,129,6],[97,2,97,6],[111,1,111,6],[193,2,193,6],[145,2,145,6],[151,2,151,6],[157,2,157,6],[170,2,170,6],[181,2,181,6],[187,2,187,6]]}
[null,"v.201704"]
[null,"Appuyer la pratique artistique : Innovation et développement du secteur - Subventions  composites (Mise à jour Année 1)"]
[]
[null,"Veuillez inscrire ci-dessous les dépenses relatives à votre projet  ","Budget, 1er exercice","1re mise à jour, 1er exercice, \nau besoin","2e mise à jour, 1er exercise, \nau besoin","Données réelles, 1er exercice ","Notes au budget (facultatif) "]
[null,"Vos données dans les lignes ci-dessous sont transmises à partir de votre budget précédent. Vous pouvez les modifier si nécessaire.","de","de","de","de"]
[null,null,{"$f":"+'D COMP Budget'!C6","v":"Date :"},"Date :","Date :","Date :"]
[null,null,"à","à","à","à"]
[null,null,{"$f":"+'D COMP Budget'!C8","v":"Date :"},"Date :","Date :","Date :"]
[]
[null,"Honoraires professionnels"]
[null,{"$f":"IF(ISBLANK('D COMP Budget'!B11),\"\",'D COMP Budget'!B11)","v":"Expert-conseil, responsable des ateliers, technicien, mentor, personnel chargé de la documentation et responsable de l’événement, par exemple"}]
[null,{"$f":"IF(ISBLANK('D COMP Budget'!B12),\"\",'D COMP Budget'!B12)","v":"Redevances et droits d’auteur"}]
[null,{"$f":"IF(ISBLANK('D COMP Budget'!B13),\"\",'D COMP Budget'!B13)","v":""}]
[null,{"$f":"IF(ISBLANK('D COMP Budget'!B14),\"\",'D COMP Budget'!B14)","v":""}]
[null,{"$f":"IF(ISBLANK('D COMP Budget'!B15),\"\",'D COMP Budget'!B15)","v":""}]
{"$rows_left_out":228}
{"sheet":"G COMP Mise à jour Année 2","index":7,"n_rows":242,"n_cols":10,"rows_kept":242,"cut":false,"hidden":false,"merged":[[1,1,1,9],[9,1,9,9],[4,1,7,1],[39,1,39,9],[96,2,96,9],[181,2,181,9],[111,1,111,9],[129,1,129,9],[170,2,170,9],[24,1,24,9],[97,2,97,9],[132,1,132,9],[165,1,165,9],[178,1,178,9],[133,2,133,9],[139,2,139,9],[145,2,145,9],[151,2,151,9],[157,2,157,9],[241,1,242,5],[187,2,187,9],[193,2,193,9],[199,2,199,9],[205,2,205,9],[227,2,227,9],[213,1,213,9],[221,1,221,9]]}
[null,"v.201704"]
[null,"Appuyer la pratique artistique : Innovation et développement du secteur - Subventions  composites (Mise à jour Année 2)"]
[]
[null,"Veuillez inscrire ci-dessous les dépenses relatives à votre projet  ","Données réelles, 1er exercice ","Budget, 2e exercice \n(s’il y a lieu)","1re mise à jour, 2e exercice, \nau besoin","2e mise à jour, 2e exercice, \nau besoin","3e mise à jour, 2e exercice, \nau besoin","Données réelles, 2e exercice ","Données réelles, 1er et 2e exercices ","Notes au budget (facultatif) "]
[null,"Vos données dans les lignes ci-dessous sont transmises à partir de votre budget précédent. Vous pouvez les modifier si nécessaire.","de","de","de","de","de","de"]
[null,null,{"$f":"+'F COMP Mise à jour Année 1'!F6","v":"Date :"},{"$f":"+'D COMP Budget'!D6","v":"Date :"},"Date :","Date :","Date :","Date :"]
[null,null,"à","à","à","à","à","à"]
[null,null,{"$f":"+'F COMP Mise à jour Année 1'!F8","v":"Date :"},{"$f":"+'D COMP Budget'!D8","v":"Date :"},"Date :","Date :","Date :","Date :"]
[]
[null,"Honoraires professionnels"]
[null,{"$f":"IF(ISBLANK('D COMP Budget'!B11),\"\",'D COMP Budget'!B11)","v":"Expert-conseil, responsable des ateliers, technicien, mentor, personnel chargé de la documentation et responsable de l’événement, par exemple"}]
[null,{"$f":"IF(ISBLANK('D COMP Budget'!B12),\"\",'D COMP Budget'!B12)","v":"Redevances et droits d’auteur"}]
[null,{"$f":"IF(ISBLANK('F COMP Mise à jour Année 1'!B13),\"\",'F COMP Mise à jour Année 1'!B13)","v":""}]
[null,{"$f":"IF(ISBLANK('F COMP Mise à jour Année 1'!B14),\"\",'F COMP Mise à jour Année 1'!B14)","v":""}]
[null,{"$f":"IF(ISBLANK('F COMP Mise à jour Année 1'!B15),\"\",'F COMP Mise à jour Année 1'!B15)","v":""}]
{"$rows_left_out":228}
{"sheet":"H COMP Mise à jour Année 3","index":8,"n_rows":242,"n_cols":11,"rows_kept":242,"cut":false,"hidden":false,"merged":[[181,2,181,10],[39,1,39,10],[96,2,96,10],[97,2,97,10],[111,1,111,10],[129,1,129,10],[170,2,170,10],[139,2,139,10],[145,2,145,10],[151,2,151,10],[157,2,157,10],[24,1,24,10],[1,1,1,10],[9,1,9,10],[4,1,7,1],[133,2,133,10],[241,2,242,6],[187,2,187,10],[193,2,193,10],[199,2,199,10],[205,2,205,10],[227,2,227,10]]}
[null,"v.201704"]
[null,"Appuyer la pratique artistique : Innovation et développement du secteur - Subventions  composites (Mise à jour Année 3)"]
[]
[null,"Veuillez inscrire ci-dessous les dépenses relatives à votre projet  ","Données réelles, 1er exercice ","Données réelles, 2e exercice ","Budget, 3e exercice","1re mise à jour, 3e exercice, \nau besoin","2me mise à jour, 3e exercice, \nau besoin","3me mise à jour, 3e exercice, \nau besoin","Données réelles, 3e exercice ","Données réelles, 1er, 2e, et 3e exercices ","Notes au budget (facultatif) "]
[null,"Vos données dans les lignes ci-dessous sont transmises à partir de votre budget précédent. Vous pouvez les modifier si nécessaire.","de","de","de","de","de","de","de"]
[null,null,{"$f":"+'G COMP Mise à jour Année 2'!C6","v":"Date :"},{"$f":"+'G COMP Mise à jour Année 2'!H6","v":"Date :"},{"$f":"+'D COMP Budget'!E6","v":"Date :"},"Date :","Date :","Date :","Date :"]
[null,null,"à","à","à","à","à","à","à"]
[null,null,{"$f":"+'G COMP Mise à jour Année 2'!C8","v":"Date :"},{"$f":"+'G COMP Mise à jour Année 2'!H8","v":"Date :"},{"$f":"+'D COMP Budget'!E8","v":"Date :"},"Date :","Date :","Date :","Date :"]
[]
[null,"Honoraires professionnels"]
[null,{"$f":"IF(ISBLANK('D COMP Budget'!B11),\"\",'D COMP Budget'!B11)","v":"Expert-conseil, responsable des ateliers, technicien, mentor, personnel chargé de la documentation et responsable de l’événement, par exemple"}]
[null,{"$f":"IF(ISBLANK('D COMP Budget'!B12),\"\",'D COMP Budget'!B12)","v":"Redevances et droits d’auteur"}]
[null,{"$f":"IF(ISBLANK('G COMP Mise à jour Année 2'!B13),\"\",'G COMP Mise à jour Année 2'!B13)","v":""}]
[null,{"$f":"IF(ISBLANK('G COMP Mise à jour Année 2'!B14),\"\",'G COMP Mise à jour Année 2'!B14)","v":""}]
[null,{"$f":"IF(ISBLANK('G COMP Mise à jour Année 2'!B15),\"\",'G COMP Mise à jour Année 2'!B15)","v":""}]
{"$rows_left_out":228}
{"sheet":"I Instructions - éditeurs","index":9,"n_rows":54,"n_cols":3,"rows_kept":54,"cut":false,"hidden":false,"merged":[[1,1,1,15],[2,1,2,15],[3,1,3,15],[4,1,4,15],[6,1,6,15],[53,1,54,15],[7,1,8,15],[20,2,21,15],[24,2,25,15],[31,1,33,15],[49,1,50,15],[51,1,52,15],[18,1,19,15],[48,1,48,15],[34,1,35,15],[43,1,45,15],[36,2,38,15],[39,2,40,15],[22,2,23,15]]}
[null,"v.201704"]
[null,"Appuyer la pratique artistique : Innovation et développement du secteur (éditeurs)"]
[null,"Instructions pour remplir les documents « Budgets »"]
[null,"Tout autre type d'organisme doit plutôt consulter l'onglet « A PROJ Instructions » pour les instructions de subventions de projets."]
[null,"Tout autre type d'organisme doit plutôt consulter l'onglet « C COMP Instructions » pour les instructions de subventions composites."]
[]
[null,"Veuillez noter qu'au bas de la page se trouvent plusieurs onglets :"]
[null,"Les éditeurs de livres et de revues doivent consulter les onglets « I Instructions - éditeurs », « J Budget Projets de livres », « K Budget Revues électroniques », et « L Budget Revues imprimées »."]
[]
[]
[]
[]
[null,"À la suite de ces instructions, chaque onglet contient une feuille distincte que vous devez compléter."]
[null,"Lorsque vous cliquez sur « Sauvegarder », tous les onglets sont sauvegardés en même temps."]
[null,"Lorsque vous téléversez le document à votre formulaire de demande, tous les onglets y sont transférés ensemble. "]
{"$rows_left_out":40}
{"sheet":"J Budget Projets de livres","index":10,"n_rows":56,"n_cols":9,"rows_kept":56,"cut":false,"hidden":false,"merged":[[1,1,1,8],[10,1,10,8],[11,6,16,6],[17,1,17,8],[4,2,5,2],[4,3,5,3],[4,4,5,4],[4,5,5,5],[4,7,5,7],[4,8,5,8],[3,1,3,5],[3,7,3,8],[23,2,23,8],[49,6,55,6],[27,2,27,8],[28,6,32,6],[33,1,33,8],[34,6,39,6],[40,1,40,8],[41,6,47,6],[48,2,48,8]]}
[null,"v.201704"]
[null,"Appuyer la pratique artistique : Innovation et développement du secteur - Projets de livres"]
[]
[null,"Sommaire financier",null,null,null,null,null,"Pour votre rapport final"]
[null,"Date : ","Avant-dernier exercice financier\nDonnées réelles","Dernier exercice financier\nDonnées réelles","Exercice financier \nen cours\nDonnées projetées","Exercice financier visé par la demande\nDonnées projetées",null,"Exercice financier \nen cours\nDonnées réelles\n(facultatif)","Année de la demande\nDonnées réelles"]
[]
[null,null,"de","de","de","de",null,"de","de"]
[null,null,"Date : ","Date : ","Date : ","Date : ",null,"Date : ","Date : "]
[null,null,"à","à","à","à",null,"à","à"]
[null,null,"Date : ","Date : ","Date : ","Date : ",null,"Date : ","Date : "]
[null,"Recettes de fonctionnement"]
[null,"Ventes nettes de titres admissibles au financement du Conseil des Arts du Canada"]
[null,"Ventes nettes d'autres titres d'auteurs canadiens, propre impression"]
[null,"Autres revenus nets d'édition"]
[null,"Autres revenus, tels que les intérêts (précisez)"]
{"$rows_left_out":42}
{"sheet":"K Budget Revues électroniques","index":11,"n_rows":156,"n_cols":15,"rows_kept":156,"cut":false,"hidden":false,"merged":[[1,1,1,14],[7,2,7,3],[7,4,7,5],[7,6,7,7],[7,8,7,9],[7,11,7,12],[7,13,7,14],[6,2,6,3],[6,4,6,5],[4,2,5,3],[3,1,3,10],[3,11,3,14],[7,1,9,1],[4,13,5,14],[6,13,6,14],[8,13,8,14],[9,2,9,3],[9,4,9,5],[9,6,9,7],[9,8,9,9],[9,11,9,12],[9,13,9,14],[8,2,8,3],[8,4,8,5],[8,6,8,7],[8,8,8,9],[8,11,8,12],[6,6,6,7],[6,8,6,9],[6,11,6,12],[4,4,5,5],[4,6,5,7],[4,8,5,9],[4,11,5,12],[10,1,10,14],[11,10,16,10],[17,1,17,14],[18,10,21,10],[65,1,65,14],[66,1,66,14],[22,1,22,14],[23,10,29,10],[30,1,30,14],[31,1,31,14],[32,1,32,14],[33,1,33,14],[34,10,40,10],[41,1,41,14],[42,10,47,10],[48,1,48,14],[49,10,63,10],[64,1,64,14],[82,10,89,10],[90,1,90,14],[91,10,94,10],[139,13,139,14],[137,11,137,12],[125,1,125,14],[126,10,133,10],[134,1,134,14],[67,10,71,10],[72,1,72,14],[73,10,80,10],[81,1,81,14],[95,1,95,14],[96,10,110,10],[111,1,111,14],[112,10,117,10],[118,1,118,14],[119,10,124,10],[135,13,135,14],[136,2,136,3],[136,4,136,5],[136,6,136,7],[136,8,136,9],[136,11,136,12],[136,13,136,14],[135,2,135,3],[135,4,135,5],[135,6,135,7],[135,8,135,9],[135,10,139,10],[135,11,135,12],[137,2,137,3],[137,4,137,5],[137,6,137,7],[137,8,137,9],[139,11,139,12],[139,4,139,5],[139,6,139,7],[137,13,137,14],[138,2,138,3],[139,8,139,9],[138,11,138,12],[138,13,138,14],[153,2,153,9],[154,2,154,9],[155,2,155,9],[147,2,147,9],[148,2,148,9],[149,2,149,9],[150,2,150,9],[151,2,151,9],[152,2,152,9],[141,1,141,9],[142,1,142,9],[143,2,143,9],[144,2,144,9],[145,2,145,9],[146,2,146,9],[138,4,138,5],[138,6,138,7],[138,8,138,9],[139,2,139,3]]}
[null,"v.201704"]
[null,"Appuyer la pratique artistique : Innovation et développement du secteur - Revues électroniques"]
[]
[null,null,null,null,null,null,null,null,null,null,null,"Pour votre rapport final"]
[null,"Date : ","Avant-dernier exercice financier\nDonnées réelles",null,"Dernier exercice financier\nDonnées réelles",null,"Exercice financier \nen cours\nDonnées projetées",null,"Exercice financier visé par la demande\nDonnées projetées",null,null,"Exercice financier \nen cours\nDonnées réelles\n(facultatif)",null,"Année de la demande\nDonnées réelles"]
[null,"(Voir la définition des termes au bas du formulaire de demande, ainsi que les instructions au bas de cette page avant de remplir ce formulaire.)"]
[null,null,"de",null,"de",null,"de",null,"de",null,null,"de",null,"de"]
[null,"(Remarque : Les renseignements inscrits dans les deux premières colonnes devraient correspondre aux chiffres indiqués dans les états financiers joints à cette demande.)","Date : ",null,"Date : ",null,"Date : ",null,"Date : ",null,null,"Date : ",null,"Date : "]
[null,null,"à",null,"à",null,"à",null,"à",null,null,"à",null,"à"]
[null,null,"Date : ",null,"Date : ",null,"Date : ",null,"Date : ",null,null,"Date : ",null,"Date : "]
[null,"Données sur le tirage et la publication - revues électroniques"]
[null,"% du contenu en langue anglaise"]
[null,"% du contenu en langue française"]
[null,"% du contenu en d’autres langues"]
[null,"Précisez les langues :"]
{"$rows_left_out":142}
{"sheet":"L Budget Revues imprimées","index":12,"n_rows":165,"n_cols":15,"rows_kept":165,"cut":false,"hidden":false,"merged":[[4,2,5,3],[4,4,5,5],[4,6,5,7],[4,8,5,9],[4,11,5,12],[4,13,5,14],[7,6,7,7],[7,8,7,9],[1,1,1,14],[6,2,6,3],[6,4,6,5],[6,6,6,7],[6,8,6,9],[6,11,6,12],[6,13,6,14],[3,1,3,10],[3,11,3,14],[7,11,7,12],[9,2,9,3],[9,4,9,5],[9,6,9,7],[9,8,9,9],[32,1,32,14],[28,1,28,14],[9,11,9,12],[9,13,9,14],[7,1,9,1],[8,4,8,5],[8,6,8,7],[8,8,8,9],[8,11,8,12],[8,13,8,14],[7,2,7,3],[7,4,7,5],[7,13,7,14],[8,2,8,3],[93,10,98,10],[99,1,99,14],[104,1,104,14],[36,1,36,14],[37,14,42,14],[43,1,43,14],[44,1,44,14],[45,1,45,14],[10,1,10,14],[17,1,17,14],[18,10,23,10],[24,1,24,14],[25,10,27,10],[55,1,55,14],[62,1,62,14],[63,10,77,10],[78,1,78,14],[79,1,79,14],[80,1,80,14],[86,1,86,14],[87,10,91,10],[92,1,92,14],[155,2,155,9],[148,2,148,3],[148,4,148,5],[148,6,148,7],[148,8,148,9],[105,10,119,10],[120,1,120,14],[121,10,126,10],[127,1,127,14],[128,10,133,10],[134,1,134,14],[150,1,150,9],[151,1,151,9],[152,2,152,9],[153,2,153,9],[154,2,154,9],[147,13,147,14],[148,11,148,12],[148,13,148,14],[147,11,147,12],[135,10,142,10],[143,1,143,14],[144,2,144,3],[144,4,144,5],[162,2,162,9],[163,2,163,9],[164,2,164,9],[156,2,156,9],[157,2,157,9],[158,2,158,9],[159,2,159,9],[160,2,160,9],[161,2,161,9],[144,6,144,7],[144,8,144,9],[144,10,148,10],[144,11,144,12],[144,13,144,14],[145,2,145,3],[145,4,145,5],[145,6,145,7],[145,8,145,9],[145,11,145,12],[145,13,145,14],[146,13,146,14],[147,2,147,3],[146,2,146,3],[146,4,146,5],[146,6,146,7],[146,8,146,9],[146,11,146,12],[147,4,147,5],[147,6,147,7],[147,8,147,9]]}
[null,"v.201704"]
[null,"Appuyer la pratique artistique : Innovation et développement du secteur - Revues imprimées"]
[]
[null,null,null,null,null,null,null,null,null,null,null,"Pour votre rapport final"]
[null,"Date : ","Avant-dernier exercice financier\nDonnées réelles",null,"Dernier exercice financier\nDonnées réelles",null,"Exercice financier \nen cours\nDonnées projetées",null,"Exercice financier visé par la demande\nDonnées projetées",null,null,"Exercice financier \nen cours\nDonnées réelles\n(facultatif)",null,"Année de la demande\nDonnées réelles"]
[null,"(Voir la définition des termes au bas du formulaire de demande, ainsi que les instructions au bas de cette page avant de remplir ce formulaire.)"]
[null,null,"de",null,"de",null,"de",null,"de",null,null,"de",null,"de"]
[null,"(Remarque : Les renseignements inscrits dans les deux premières colonnes devraient correspondre aux chiffres indiqués dans les états financiers joints à cette demande.)","Date : ",null,"Date : ",null,"Date : ",null,"Date : ",null,null,"Date : ",null,"Date : "]
[null,null,"à",null,"à",null,"à",null,"à",null,null,"à",null,"à"]
[null,null,"Date : ",null,"Date : ",null,"Date : ",null,"Date : ",null,null,"Date : ",null,"Date : "]
[null,"Données sur le tirage et la publication - revues imprimées"]
[null,"% du contenu en langue anglaise"]
[null,"% du contenu en langue française"]
[null,"% du contenu en d’autres langues"]
[null,"Précisez les langues :"]
{"$rows_left_out":151}
{"sheet":"Sheet1","index":13,"n_rows":27,"n_cols":9,"rows_kept":27,"cut":false,"hidden":true,"merged":[]}
[null,null,null,null,null,null,null,null,"v.201704"]
[]
[]
[null,null,null,"activity drop down",null,"translate"]
[null,null,null,"SELECT",null,"SÉLECTIONNEZ"]
[null,null,null,"Collection",null,"Collection"]
[null,null,null,"Equipment",null,"Équipement (arts médiatique)"]
[null,null,null,"Production",null,"Production"]
[null,null,null,"Publication",null,"Publication"]
[null,null,null,"Other",null,"Autre"]
[]
[]
[null,null,null,"media arts drop down",null,"translate"]
[null,null,null,"SELECT",null,"SÉLECTIONNEZ"]
[null,null,null,"For distribution",null,"Pour distribution"]
{"$rows_left_out":12}