{"text_format":"1","workbook":"xlsx","n_sheets":14,"sheets":["Macro","A PROJ Instructions","B PROJ Budget","C COMP Instructions","D COMP Budget","E COMP Activities","F COMP Year 1 Updates","G COMP Year 2 Updates","H COMP Year 3 Updates","I Instructions -publishers","J Budget Book Projects ","K Budget Electronic Magazines","L Budget Print Magazines","Sheet1"],"not_rendered":{"charts":0,"images":5,"macros":1,"external_links":0,"defined_names":24,"comments":0,"pivot_tables":0},"unopened":[],"bounds":{"document_bytes":16777216,"sheet_cells":100000,"rows_first":2000,"rows_last":500,"rows_between":2000,"halvings":0,"cell_chars":16384,"cell_head_chars":4096},"cells_cut":0,"cells_raw":0,"read":"whole","date_system":"1900"}

{"sheet":"Macro","index":0,"n_rows":36,"n_cols":2,"rows_kept":36,"cut":false,"hidden":false,"merged":[[35,1,36,15],[1,1,1,11],[29,1,29,11],[4,1,4,15],[6,1,7,15],[3,1,3,15],[24,1,24,15],[31,1,31,15],[33,1,33,15],[15,1,16,15],[18,1,18,15],[21,1,21,15]]}
[]
[]
[]
[null,"Supporting Artistic Practice"]
[null,"Sector Innovation and Development"]
[]
[null,"This component supports many types of activities and they have their own section of tabs with budget pages. This document has a built-in macro to help direct you to the section that relates to your activities. Select the relevant button below for your type of activity. "]
[]
[]
[]
[]
[]
[]
[]
[]
{"$rows_left_out":22}
{"sheet":"A PROJ Instructions","index":1,"n_rows":52,"n_cols":3,"rows_kept":52,"cut":false,"hidden":false,"merged":[[27,2,28,14],[29,2,30,15],[1,1,1,15],[3,1,3,15],[14,1,14,15],[2,1,2,15],[4,1,4,15],[7,1,11,15],[39,2,39,15],[40,1,41,15],[42,2,43,15],[44,2,44,15],[48,1,49,15]]}
[null,"v.201704"]
[null,"Supporting Artistic Practice: Sector Innovation and Development - Project grants (except for publishers)"]
[null,"Instructions for filling out the Budget  and Appendices Documents"]
[null,"For Composite grant instructions, go to tab C"]
[null,"Instructions for book and magazine publishers are on tab J"]
[]
[]
[null,"Please remember that the budget form is designed to be used by applicants from different fields of practice (disciplines) and for a wide range of activities. It is not possible to include detailed expense categories for every activity type. Rather, you will find a number of blank lines throughout the form that you can use to specify the expenses that are relevant to your project. Select a blank line within the category of costs that best fits the expense, enter a short description that will be easily understood by an assessment committee that is familiar with your art form(s), enter the amount of the expense and add a budget note, if necessary, to explain the amount."]
[]
[]
[]
[]
[]
[null,"Please note that there are many tabs at the bottom of the page."]
[null,"Applicants for project grants need to refer only to the first 2 tabs: A PROJ Instructions and B PROJ Budget. There are no appendices for project applications."]
{"$rows_left_out":38}
{"sheet":"B PROJ Budget","index":2,"n_rows":163,"n_cols":9,"rows_kept":163,"cut":false,"hidden":false,"merged":[[1,1,1,8],[3,1,3,8],[8,1,8,8],[9,4,9,8],[5,1,5,3],[9,1,9,3],[10,1,10,3],[11,1,11,3],[12,1,12,3],[13,1,13,3],[14,1,14,3],[19,1,19,8],[22,1,22,3],[23,1,23,3],[15,1,15,3],[16,1,16,3],[17,1,17,3],[20,1,20,3],[21,1,21,3],[24,1,24,3],[25,1,25,3],[26,1,26,3],[29,1,29,3],[30,1,30,3],[81,1,81,8],[24,4,24,8],[29,4,29,8],[30,4,30,8],[33,4,33,8],[31,1,31,3],[32,1,32,3],[33,1,33,3],[34,1,34,3],[35,1,35,3],[46,1,46,3],[69,4,69,8],[72,4,72,8],[28,1,28,8],[57,1,57,8],[68,1,68,8],[36,1,36,3],[37,1,37,3],[38,1,38,3],[39,1,39,3],[40,1,40,3],[36,4,36,8],[39,4,39,8],[42,4,42,8],[43,4,43,8],[62,4,62,8],[59,4,59,8],[58,4,58,8],[47,1,47,3],[48,1,48,3],[49,1,49,3],[50,1,50,3],[41,1,41,3],[42,1,42,3],[43,1,43,3],[44,1,44,3],[45,1,45,3],[58,1,58,3],[59,1,59,3],[60,1,60,3],[61,1,61,3],[62,1,62,3],[51,1,51,3],[52,1,52,3],[53,1,53,3],[54,1,54,3],[55,1,55,3],[98,7,98,8],[108,7,108,8],[103,1,103,8],[70,1,70,3],[71,1,71,3],[72,1,72,3],[73,1,73,3],[74,1,74,3],[63,1,63,3],[64,1,64,3],[65,1,65,3],[66,1,66,3],[69,1,69,3],[75,1,75,3],[76,1,76,3],[78,1,78,3],[82,2,82,4],[82,8,83,8],[85,1,85,8],[89,7,89,8],[92,7,92,8],[95,7,95,8],[114,1,114,8],[136,1,136,8],[144,1,144,8],[162,1,163,7],[118,7,118,8],[122,7,122,8],[126,7,126,8],[130,7,130,8],[151,7,151,8]]}
[null,"v.201704"]
[null,"Supporting Artistic Practice: Sector Innovation and Development - Project Grants"]
[]
[null,"Salaries, fees and expenses that are part of Canada Council core grants are not eligible in this component. "]
[]
[null," Fill out the items below that pertain to your project",null,null,"Budget","Update 1, if required","Update 2, if required","Actual","Budget Notes (Optional)"]
[null,null,null,null,"Date:","Date:","Date:","Date:"]
[]
[null,"Professional Fees"]
[null,"e.g. Consultant, workshop leader, technician, mentor, documentation staff, event manager, etc."]
[null,"Applicant fee or Subsistence  For projects of 5 days or more in duration, you may include either an appropriate fee for your services or subsistence up to $500/person/week. Include details in budget notes."]
[null,"Royalties and copyright"]
[]
[]
[]
{"$rows_left_out":149}
{"sheet":"C COMP Instructions","index":3,"n_rows":57,"n_cols":3,"rows_kept":57,"cut":false,"hidden":false,"merged":[[54,1,55,15],[58,2,58,15],[1,1,1,15],[2,1,2,15],[3,1,3,15],[4,1,4,15],[32,2,33,14],[47,2,47,15],[48,1,48,15],[49,2,50,15],[51,2,51,15],[34,2,35,15],[28,2,29,15],[30,2,31,15],[7,1,11,15]]}
[null,"v.201704"]
[null,"Supporting Artistic Practice: Sector Innovation and Development - Ccomposite grants (except for publishers)"]
[null,"Instructions for filling out the Budget  and Appendices Documents"]
[null,"For Project grant instructions, go to tab A"]
[null,"Instructions for book and magazine publishers are on tab J"]
[]
[]
[null,"Please remember that the budget form is designed to be used by applicants from different fields of practice (disciplines) and for a wide range of activities. It is not possible to include detailed expense categories for every activity type. Rather, you will find a number of blank lines throughout the form that you can use to specify the expenses that are relevant to your activities. Select a blank line within the category of costs that best fits the expense, enter a short description that will be easily understood by an assessment committee that is familiar with your art form(s), enter the amount of the expense and add a budget note, if necessary, to explain the amount."]
[]
[]
[]
[]
[]
[null,"Please note that there are many tabs at the bottom of the page."]
[null,"Applicants for composite grants need to refer to tabs C, D and E when applying."]
{"$rows_left_out":43}
{"sheet":"D COMP Budget","index":4,"n_rows":242,"n_cols":7,"rows_kept":242,"cut":false,"hidden":false,"merged":[[241,1,242,5],[199,2,199,6],[205,2,205,6],[151,2,151,6],[157,2,157,6],[170,2,170,6],[165,1,165,6],[193,2,193,6],[227,2,227,6],[181,2,181,6],[187,2,187,6],[178,1,178,6],[213,1,213,6],[221,1,221,6],[97,2,97,6],[111,1,111,6],[129,1,129,6],[139,2,139,6],[145,2,145,6],[133,2,133,6],[132,1,132,6],[96,2,96,6],[1,1,1,6],[9,1,9,6],[39,1,39,6],[5,1,7,1],[24,1,24,6]]}
[null,"v.201704"]
[null,"Supporting Artistic Practice: Sector Innovation and Development - Composite Grants"]
[]
[null,null,"Budget Year 1","Budget Year 2 \n(if applicable)","Budget Year 3 \n(if applicable)","Total Budget for All Years","Budget Notes (Optional)"]
[null,null,"from","from","from"]
[null," Fill out the items below that pertain to your activities","Date:","Date:","Date:"]
[null,null,"to","to","to"]
[null,null,"Date:","Date:","Date:"]
[]
[null,"Professional Fees"]
[null,"e.g. Consultant, workshop leader, technician, mentors, documentation staff, event manager, etc."]
[null,"Royalties and copyright",null,null,null,{"$f":"C12+D12+E12","v":0}]
[null,null,null,null,null,0]
[null,null,null,null,null,0]
[null,null,null,null,null,0]
{"$rows_left_out":228}
{"sheet":"E COMP Activities","index":5,"n_rows":50,"n_cols":9,"rows_kept":50,"cut":false,"hidden":false,"merged":[[3,2,3,8],[5,2,5,8],[6,2,6,8],[7,2,7,8],[1,2,1,8]]}
[null,null,"v.201704"]
[null,null,"Supporting Artistic Practice: Sector Innovation and Development - Composite Grants"]
[]
[null,null,"Services, Support Activities, Public Events and Ancillary Programming"]
[]
[null,null,"Provide a representative list of  the services, support activities, public events and ancillary programming you have delivered in the last 2 years and current year, as well as details for your future plans as much as you know them for the period covered by the grant request. The first future year should be quite solid. However, it is understood that you may have less detail as you go further into the future."]
[null,null,"Examples of activities to include: Screening, presentation, reading, representation of artists at events, residency, showcase, research, workshop for professional artists, etc."]
[null,null,"If necessary, group together similar programs or activities. "]
[]
[null,null,"Month/Year or Time Period","Name of Event \n(if applicable)","Type of Activity","Key Contributor or \nActivity Leader","Other Major Contributors ","Primary Beneficiaries","Details/Comments"]
[null,1]
[null,2]
[null,3]
[null,4]
[null,5]
{"$rows_left_out":36}
{"sheet":"F COMP Year 1 Updates","index":6,"n_rows":242,"n_cols":7,"rows_kept":242,"cut":false,"hidden":false,"merged":[[241,1,242,5],[227,2,227,6],[133,2,133,6],[139,2,139,6],[145,2,145,6],[151,2,151,6],[157,2,157,6],[170,2,170,6],[181,2,181,6],[187,2,187,6],[221,1,221,6],[213,1,213,6],[193,2,193,6],[199,2,199,6],[205,2,205,6],[1,1,1,6],[9,1,9,6],[24,1,24,6],[39,1,39,6],[96,2,96,6],[111,1,111,6],[4,1,7,1],[132,1,132,6],[165,1,165,6],[178,1,178,6],[129,1,129,6],[97,2,97,6]]}
[null,"v.201704"]
[null,"Supporting Artistic Practice: Sector Innovation and Development - Composite Grants (Year 1 Updates)"]
[]
[null," Fill out the items below that pertain to your activities","Budget Year 1","Year 1 Update 1, \nif required","Year 1 Update 2, \nif required","Year 1\nActual","Budget Notes (Optional)"]
[null,"Your entries in the rows below are forwarded from the last budget. You can change them if necessary.","from","from","from","from"]
[null,null,{"$f":"+'D COMP Budget'!C6","v":"Date:"},"Date:","Date:","Date:"]
[null,null,"to","to","to","to"]
[null,null,{"$f":"+'D COMP Budget'!C8","v":"Date:"},"Date:","Date:","Date:"]
[]
[null,"Professional Fees"]
[null,"e.g. Consultant, workshop leader, technician, mentors, documentation staff, event manager, etc."]
[null,{"$f":"IF(ISBLANK('D COMP Budget'!B12),\"\",'D COMP Budget'!B12)","v":"Royalties and copyright"}]
[null,{"$f":"IF(ISBLANK('D COMP Budget'!B13),\"\",'D COMP Budget'!B13)","v":""}]
[null,{"$f":"IF(ISBLANK('D COMP Budget'!B14),\"\",'D COMP Budget'!B14)","v":""}]
[null,{"$f":"IF(ISBLANK('D COMP Budget'!B15),\"\",'D COMP Budget'!B15)","v":""}]
{"$rows_left_out":228}
{"sheet":"G COMP Year 2 Updates","index":7,"n_rows":242,"n_cols":10,"rows_kept":242,"cut":false,"hidden":false,"merged":[[241,1,242,5],[199,2,199,9],[205,2,205,9],[227,2,227,9],[213,1,213,9],[221,1,221,9],[187,2,187,9],[193,2,193,9],[4,1,7,1],[24,1,24,9],[145,2,145,9],[151,2,151,9],[157,2,157,9],[170,2,170,9],[1,1,1,9],[9,1,9,9],[181,2,181,9],[39,1,39,9],[96,2,96,9],[97,2,97,9],[111,1,111,9],[129,1,129,9],[133,2,133,9],[139,2,139,9],[132,1,132,9],[165,1,165,9],[178,1,178,9]]}
[null,"v.201704"]
[null,"Supporting Artistic Practice: Sector Innovation and Development - Composite Grants (Year 2 Updates)"]
[]
[null," Fill out the items below that pertain to your activities","Year 1 Actual","Budget Year 2","Year 2 Update 1, \nif required","Year 2 Update 2, \nif required","Year 2 Update 3, if required","Year 2 Actual","Year 1 and 2\nActual","Budget Notes (Optional)"]
[null,"Your entries in the rows below are forwarded from the last budget. You can change them if necessary.","from","from","from","from","from","from"]
[null,null,{"$f":"+'F COMP Year 1 Updates'!F6","v":"Date:"},{"$f":"+'D COMP Budget'!D6","v":"Date:"},"Date:","Date:","Date:","Date:"]
[null,null,"to","to","to","to","to","to"]
[null,null,{"$f":"+'F COMP Year 1 Updates'!F8","v":"Date:"},{"$f":"+'D COMP Budget'!D8","v":"Date:"},"Date:","Date:","Date:","Date:"]
[]
[null,"Professional Fees"]
[null,"e.g. Consultant, workshop leader, technician, mentors, documentation staff, event manager, etc."]
[null,{"$f":"IF(ISBLANK('D COMP Budget'!B12),\"\",'D COMP Budget'!B12)","v":"Royalties and copyright"}]
[null,{"$f":"IF(ISBLANK('F COMP Year 1 Updates'!B13),\"\",'F COMP Year 1 Updates'!B13)","v":""}]
[null,{"$f":"IF(ISBLANK('F COMP Year 1 Updates'!B14),\"\",'F COMP Year 1 Updates'!B14)","v":""}]
[null,{"$f":"IF(ISBLANK('F COMP Year 1 Updates'!B15),\"\",'F COMP Year 1 Updates'!B15)","v":""}]
{"$rows_left_out":228}
{"sheet":"H COMP Year 3 Updates","index":8,"n_rows":242,"n_cols":11,"rows_kept":242,"cut":false,"hidden":false,"merged":[[241,1,242,5],[199,2,199,10],[205,2,205,10],[227,2,227,10],[221,1,221,10],[213,1,213,10],[187,2,187,10],[193,2,193,10],[4,1,7,1],[24,1,24,10],[145,2,145,10],[151,2,151,10],[157,2,157,10],[170,2,170,10],[1,1,1,10],[9,1,9,10],[181,2,181,10],[39,1,39,10],[96,2,96,10],[97,2,97,10],[111,1,111,10],[129,1,129,10],[133,2,133,10],[139,2,139,10],[178,1,178,10],[165,1,165,10],[132,1,132,10]]}
[null,"v.201704"]
[null,"Supporting Artistic Practice: Sector Innovation and Development - Composite Grants (Year 3 Updates)"]
[]
[null," Fill out the items below that pertain to your activities","Year 1\nActual","Year 2\nActual","Budget Year 3","Year 3 Update 1, \nif required","Year 3 Update 2, \nif required","Year 3 Update 3, \nif required","Year 3\nActual","Years 1, 2 and 3, Actual","Budget Notes (Optional)"]
[null,"Your entries in the rows below are forwarded from the last budget. You can change them if necessary.","from","from","from","from","from","from","from"]
[null,null,{"$f":"+'G COMP Year 2 Updates'!C6","v":"Date:"},{"$f":"+'G COMP Year 2 Updates'!H6","v":"Date:"},{"$f":"+'D COMP Budget'!E6","v":"Date:"},"Date:","Date:","Date:","Date:"]
[null,null,"to","to","to","to","to","to","to"]
[null,null,{"$f":"+'G COMP Year 2 Updates'!C8","v":"Date:"},{"$f":"+'G COMP Year 2 Updates'!H8","v":"Date:"},{"$f":"+'D COMP Budget'!E8","v":"Date:"},"Date:","Date:","Date:","Date:"]
[]
[null,"Professional Fees"]
[null,"e.g. Consultant, workshop leader, technician, mentors, documentation staff, event manager, etc."]
[null,{"$f":"IF(ISBLANK('D COMP Budget'!B12),\"\",'D COMP Budget'!B12)","v":"Royalties and copyright"}]
[null,{"$f":"IF(ISBLANK('G COMP Year 2 Updates'!B13),\"\",'G COMP Year 2 Updates'!B13)","v":""}]
[null,{"$f":"IF(ISBLANK('G COMP Year 2 Updates'!B14),\"\",'G COMP Year 2 Updates'!B14)","v":""}]
[null,{"$f":"IF(ISBLANK('G COMP Year 2 Updates'!B15),\"\",'G COMP Year 2 Updates'!B15)","v":""}]
{"$rows_left_out":228}
{"sheet":"I Instructions -publishers","index":9,"n_rows":47,"n_cols":3,"rows_kept":47,"cut":false,"hidden":false,"merged":[[43,1,43,15],[23,2,23,15],[46,1,46,15],[1,1,1,15],[2,1,2,15],[3,1,3,15],[4,1,4,15],[21,2,22,15],[7,1,8,15],[19,1,20,15],[29,1,30,15],[31,1,32,15],[33,2,34,15],[35,2,36,15],[39,1,40,15],[42,1,42,15],[44,1,45,15]]}
[null,"v.201704"]
[null,"Supporting Artistic Practice: Sector Innovation and Development (publishers)"]
[null,"Instructions for filling out the Financial Summary Document"]
[null,"For other types of applicants, go to tab A for Project grant instructions."]
[null,"For other types of applicants, go to tab C for Composite grant instructions."]
[]
[null,"Please note that there are many tabs at the bottom of the page."]
[null,"Book and magazine publishers need to refer to tabs I Instructions - publishers, J Budget Book Projects, K Budget Electronic Magazines and L Budget Print Magazines."]
[]
[]
[]
[]
[null,"Each tab after these instructions contains a separate page for you to fill out."]
[null,"When you click \"save,\" you will save all the tabs at once."]
[null,"When you upload the document to your application form, all the tabs are transferred together."]
{"$rows_left_out":33}
{"sheet":"J Budget Book Projects ","index":10,"n_rows":56,"n_cols":9,"rows_kept":56,"cut":false,"hidden":false,"merged":[[48,2,48,8],[49,6,55,6],[27,2,27,8],[28,6,32,6],[33,1,33,8],[34,6,39,6],[40,1,40,8],[41,6,47,6],[23,2,23,8],[1,1,1,8],[10,1,10,8],[11,6,16,6],[17,1,17,8],[3,1,3,6],[3,7,3,8]]}
[null,"v.201704"]
[null,"Supporting Artistic Practice: Sector Innovation and Development - Book Projects"]
[]
[null,"Financial Summary",null,null,null,null,null,"For Your Final Report"]
[null,"Date: ","Prior Year","Last Year","Current Year","Request Year",null,"Current Year","Request"]
[null,null,"Actual","Actual","Projected","Projected",null,"Actual (optional)","Year Actual"]
[null,null,"from","from","from","from",null,"from","from"]
[null,null,"Date:","Date:","Date:","Date:",null,"Date:","Date:"]
[null,null,"to","to","to","to",null,"to","to"]
[null,null,"Date:","Date:","Date:","Date:",null,"Date:","Date:"]
[null,"Operating Revenues"]
[null,"Net sales of eligible titles for Canada Council funding"]
[null,"Net sales of other Canadian-authored titles, own imprint"]
[null,"Other net publishing revenues"]
[null,"Other revenues, such as interest (provide details)"]
{"$rows_left_out":42}
{"sheet":"K Budget Electronic Magazines","index":11,"n_rows":156,"n_cols":15,"rows_kept":156,"cut":false,"hidden":false,"merged":[[8,2,8,3],[126,10,133,10],[138,11,138,12],[65,1,65,14],[111,1,111,14],[112,10,117,10],[18,10,21,10],[66,1,66,14],[23,10,29,10],[23,14,29,14],[136,6,136,7],[10,1,10,14],[11,10,16,10],[17,1,17,14],[22,1,22,14],[136,11,136,12],[135,13,135,14],[137,8,137,9],[138,8,138,9],[135,11,135,12],[136,8,136,9],[137,11,137,12],[135,6,135,7],[32,1,32,14],[49,10,63,10],[64,1,64,14],[154,2,154,9],[155,2,155,9],[148,2,148,9],[149,2,149,9],[150,2,150,9],[151,2,151,9],[152,2,152,9],[143,2,143,9],[144,2,144,9],[147,2,147,9],[145,2,145,9],[146,2,146,9],[153,2,153,9],[118,1,118,14],[137,6,137,7],[137,4,137,5],[138,4,138,5],[67,10,71,10],[72,1,72,14],[73,10,80,10],[81,1,81,14],[82,10,89,10],[138,6,138,7],[142,1,142,9],[141,1,141,9],[139,4,139,5],[135,8,135,9],[139,2,139,3],[30,1,30,14],[31,1,31,14],[33,1,33,14],[139,6,139,7],[139,11,139,12],[139,8,139,9],[139,13,139,14],[34,10,40,10],[41,1,41,14],[42,10,47,10],[48,1,48,14],[136,13,136,14],[137,13,137,14],[138,13,138,14],[135,2,135,3],[136,2,136,3],[137,2,137,3],[138,2,138,3],[135,10,139,10],[5,2,5,3],[5,11,5,12],[5,13,5,14],[7,1,9,1],[5,4,5,5],[5,6,5,7],[5,8,5,9],[135,4,135,5],[136,4,136,5],[7,13,7,14],[8,13,8,14],[9,13,9,14],[7,8,7,9],[8,11,8,12],[6,2,6,3],[8,4,8,5],[7,6,7,7],[125,1,125,14],[90,1,90,14],[91,10,94,10],[95,1,95,14],[134,1,134,14],[96,10,110,10],[119,10,124,10],[1,1,1,14],[4,2,4,3],[4,4,4,5],[4,6,4,7],[4,8,4,9],[4,11,4,12],[4,13,4,14],[9,11,9,12],[7,2,7,3],[9,4,9,5],[9,2,9,3],[9,6,9,7],[3,11,3,14],[9,8,9,9],[6,4,6,5],[7,4,7,5],[6,8,6,9],[3,1,3,10],[8,8,8,9],[6,6,6,7],[6,13,6,14],[6,11,6,12],[7,11,7,12],[8,6,8,7]]}
[null,"v.201704"]
[null,"Supporting Artistic Practice: Sector Innovation and Development - Electronic Magazines"]
[]
[null,null,null,null,null,null,null,null,null,null,null,"For Your Final Report"]
[null,"Date:","Prior Year ",null,"Last Year ",null,"Current Year ",null,"Request Fiscal Year",null,null,"Current Year ",null,"Request Year "]
[null,"(Consult the Definitions of Terms at the bottom of the application form, and the instructions below before completing this form.","Actual",null,"Actual",null,"Projected",null,"Projected",null,null,"Actual\n(Optional)",null,"Actual"]
[null,null,"from",null,"from",null,"from",null,"from",null,null,"from",null,"from"]
[null,"(Note: The information provided in the first two columns should correspond to the numbers in the financial statements provided with this application.)","Date:",null,"Date:",null,"Date:",null,"Date:",null,null,"Date:",null,"Date:"]
[null,null,"to",null,"to",null,"to",null,"to",null,null,"to",null,"to"]
[null,null,"Date:",null,"Date:",null,"Date:",null,"Date:",null,null,"Date:",null,"Date:"]
[null,"Circulation and Publishing Data - Electronic Magazines"]
[null,"English-language content %"]
[null,"French-language content %"]
[null,"Other language content %"]
[null,"Specify languages"]
{"$rows_left_out":142}
{"sheet":"L Budget Print Magazines","index":12,"n_rows":165,"n_cols":15,"rows_kept":165,"cut":false,"hidden":false,"merged":[[86,1,86,14],[120,1,120,14],[121,10,126,10],[18,10,23,10],[24,1,24,14],[5,11,5,12],[5,13,5,14],[63,10,77,10],[78,1,78,14],[79,1,79,14],[80,1,80,14],[37,14,42,14],[62,1,62,14],[9,11,9,12],[8,4,8,5],[9,4,9,5],[7,6,7,7],[8,6,8,7],[6,11,6,12],[6,13,6,14],[7,2,7,3],[8,2,8,3],[9,2,9,3],[7,4,7,5],[44,1,44,14],[25,10,27,10],[32,1,32,14],[36,1,36,14],[43,1,43,14],[45,1,45,14],[55,1,55,14],[28,1,28,14],[7,13,7,14],[8,13,8,14],[9,13,9,14],[9,6,9,7],[7,8,7,9],[8,8,8,9],[9,8,9,9],[10,1,10,14],[17,1,17,14],[7,1,9,1],[7,11,7,12],[8,11,8,12],[135,10,142,10],[87,10,91,10],[92,1,92,14],[144,13,144,14],[145,13,145,14],[146,13,146,14],[147,13,147,14],[148,13,148,14],[144,11,144,12],[145,11,145,12],[146,11,146,12],[147,11,147,12],[148,11,148,12],[148,8,148,9],[144,6,144,7],[145,6,145,7],[146,6,146,7],[93,10,98,10],[99,1,99,14],[104,1,104,14],[105,10,119,10],[147,6,147,7],[148,6,148,7],[144,8,144,9],[162,2,162,9],[163,2,163,9],[164,2,164,9],[159,2,159,9],[143,1,143,14],[144,10,148,10],[150,1,150,9],[151,1,151,9],[127,1,127,14],[128,10,133,10],[134,1,134,14],[148,2,148,3],[144,4,144,5],[145,4,145,5],[146,4,146,5],[147,4,147,5],[160,2,160,9],[161,2,161,9],[148,4,148,5],[158,2,158,9],[144,2,144,3],[145,2,145,3],[146,2,146,3],[147,2,147,3],[145,8,145,9],[146,8,146,9],[147,8,147,9],[152,2,152,9],[153,2,153,9],[154,2,154,9],[155,2,155,9],[156,2,156,9],[157,2,157,9],[5,2,5,3],[5,4,5,5],[5,6,5,7],[5,8,5,9],[6,6,6,7],[6,8,6,9],[1,1,1,14],[4,2,4,3],[4,4,4,5],[4,6,4,7],[4,8,4,9],[4,11,4,12],[4,13,4,14],[3,1,3,10],[3,11,3,14],[6,2,6,3],[6,4,6,5]]}
[null,"v.201704"]
[null,"Supporting Artistic Practice: Sector Innovation and Development - Print Magazines"]
[]
[null,null,null,null,null,null,null,null,null,null,null,"For Your Final Report"]
[null,"Date:","Prior Fiscal Year ",null,"Last Fiscal Year ",null,"Current Fiscal Year ",null,"Request Fiscal Year",null,null,"Current Fiscal Year ",null,"Request Fiscal Year "]
[null,"(Consult the Definitions of Terms at the bottom of the application form, and the instructions below before completing this form.","Actual",null,"Actual",null,"Projected",null,"Projected",null,null,"Actual\n(Optional)",null,"Actual"]
[null,null,"from",null,"from",null,"from",null,"from",null,null,"from",null,"from"]
[null,"(Note: The information provided in the first two columns should correspond to the numbers in the financial statements provided with this application.)","Date:",null,"Date:",null,"Date:",null,"Date:",null,null,"Date:",null,"Date:"]
[null,null,"to",null,"to",null,"to",null,"to",null,null,"to",null,"to"]
[null,null,"Date:",null,"Date:",null,"Date:",null,"Date:",null,null,"Date:",null,"Date:"]
[null,"Circulation and Publishing Data  - Print Magazines"]
[null,"English-language content %"]
[null,"French-language content %"]
[null,"Other language content %"]
[null,"Specify languages","   "]
{"$rows_left_out":151}
{"sheet":"Sheet1","index":13,"n_rows":27,"n_cols":9,"rows_kept":27,"cut":false,"hidden":true,"merged":[]}
[null,null,null,null,null,null,null,null,"v.201704"]
[]
[]
[null,null,null,"activity drop down",null,"translate"]
[null,null,null,"SELECT",null,"SÉLECTIONNEZ"]
[null,null,null,"Collection",null,"Collection"]
[null,null,null,"Equipment",null,"Équipement (arts médiatique)"]
[null,null,null,"Production",null,"Production"]
[null,null,null,"Publication",null,"Publication"]
[null,null,null,"Other",null,"Autre"]
[]
[]
[null,null,null,"media arts drop down",null,"translate"]
[null,null,null,"SELECT",null,"SÉLECTIONNEZ"]
[null,null,null,"For distribution",null,"Pour distribution"]
{"$rows_left_out":12}